Reaction Details
TargetCannabinoid receptor 2
LigandBDBM21297
Substrate/CompetitorBDBM21244
Meas. Tech.Radioligand Binding Assay
Ki 3.2±n/a nM
EC50>10000±n/a nM
Citation Frost, JMDart, MJTietje, KRGarrison, TRGrayson, GKDaza, AVEl-Kouhen, OFMiller, LNLi, LYao, BBHsieh, GCPai, MZhu, CZChandran, PMeyer, MD Indol-3-yl-tetramethylcyclopropyl Ketones: Effects of Indole Ring Substitution on CB2 Cannabinoid Receptor Activity. J Med Chem51:1904-12 (2008) 
 
Cannabinoid receptor 2
Name:Cannabinoid receptor 2
Type:G Protein-Coupled Receptor (GPCR)
Mol. Mass.:39690.94
Organism:Homo sapiens (Human)
Description:P34972
Residue:360
BDBM21297
BDBM21244
NameBDBM21297
Synonyms:1-(oxan-4-ylmethyl)-3-[(2,2,3,3-tetramethylcyclopropyl)carbonyl]-1H-indol-7-ol | Tetrahydropyranyl-methyl analogue, 18
TypeSmall organic molecule
Emp. Form.C22H29NO3
Mol. Mass.355.4706
SMILESCC1(C)C(C(=O)c2cn(CC3CCOCC3)c3c(O)cccc23)C1(C)C