Reaction Details
TargetCannabinoid receptor 2
LigandBDBM21317
Substrate/CompetitorBDBM21244
Meas. Tech.Radioligand Binding Assay
Ki 2.9±n/a nM
EC50>10000±n/a nM
Citation Frost, JMDart, MJTietje, KRGarrison, TRGrayson, GKDaza, AVEl-Kouhen, OFMiller, LNLi, LYao, BBHsieh, GCPai, MZhu, CZChandran, PMeyer, MD Indol-3-yl-tetramethylcyclopropyl Ketones: Effects of Indole Ring Substitution on CB2 Cannabinoid Receptor Activity. J Med Chem51:1904-12 (2008) 
 
Cannabinoid receptor 2
Name:Cannabinoid receptor 2
Type:G Protein-Coupled Receptor (GPCR)
Mol. Mass.:39690.94
Organism:Homo sapiens (Human)
Description:P34972
Residue:360
BDBM21317
BDBM21244
NameBDBM21317
Synonyms:4-{2-[6-(benzyloxy)-3-[(2,2,3,3-tetramethylcyclopropyl)carbonyl]-1H-indol-1-yl]ethyl}morpholine | Morpholino-ethyl analogue, 38
TypeSmall organic molecule
Emp. Form.C29H36N2O3
Mol. Mass.460.6077
SMILESCC1(C)C(C(=O)c2cn(CCN3CCOCC3)c3cc(OCc4ccccc4)ccc23)C1(C)C