Reaction Details
TargetCannabinoid receptor 2
LigandBDBM21319
Substrate/CompetitorBDBM21244
Meas. Tech.Radioligand Binding Assay
Ki 297±n/a nM
EC50>10000±n/a nM
Citation Frost, JMDart, MJTietje, KRGarrison, TRGrayson, GKDaza, AVEl-Kouhen, OFMiller, LNLi, LYao, BBHsieh, GCPai, MZhu, CZChandran, PMeyer, MD Indol-3-yl-tetramethylcyclopropyl Ketones: Effects of Indole Ring Substitution on CB2 Cannabinoid Receptor Activity. J Med Chem51:1904-12 (2008) 
 
Cannabinoid receptor 2
Name:Cannabinoid receptor 2
Type:G Protein-Coupled Receptor (GPCR)
Mol. Mass.:39690.94
Organism:Homo sapiens (Human)
Description:P34972
Residue:360
BDBM21319
BDBM21244
NameBDBM21319
Synonyms:4-(2-{4-nitro-3-[(2,2,3,3-tetramethylcyclopropyl)carbonyl]-1H-indol-1-yl}ethyl)morpholine | Morpholino-ethyl analogue, 40
TypeSmall organic molecule
Emp. Form.C22H29N3O4
Mol. Mass.399.4834
SMILESCC1(C)C(C(=O)c2cn(CCN3CCOCC3)c3cccc([N+]([O-])=O)c23)C1(C)C