Reaction Details
TargetCannabinoid receptor 2
LigandBDBM21321
Substrate/CompetitorBDBM21244
Meas. Tech.Radioligand Binding Assay
Ki>1000±n/a nM
EC50>10000±n/a nM
Citation Frost, JMDart, MJTietje, KRGarrison, TRGrayson, GKDaza, AVEl-Kouhen, OFMiller, LNLi, LYao, BBHsieh, GCPai, MZhu, CZChandran, PMeyer, MD Indol-3-yl-tetramethylcyclopropyl Ketones: Effects of Indole Ring Substitution on CB2 Cannabinoid Receptor Activity. J Med Chem51:1904-12 (2008) 
 
Cannabinoid receptor 2
Name:Cannabinoid receptor 2
Type:G Protein-Coupled Receptor (GPCR)
Mol. Mass.:39690.94
Organism:Homo sapiens (Human)
Description:P34972
Residue:360
BDBM21321
BDBM21244
NameBDBM21321
Synonyms:Morpholino-ethyl analogue, 42 | N-{1-[2-(morpholin-4-yl)ethyl]-3-[(2,2,3,3-tetramethylcyclopropyl)carbonyl]-1H-indol-4-yl}acetamide
TypeSmall organic molecule
Emp. Form.C24H33N3O3
Mol. Mass.411.5371
SMILESCC(=O)Nc1cccc2n(CCN3CCOCC3)cc(C(=O)C3C(C)(C)C3(C)C)c12