Reaction Details
TargetCannabinoid receptor 2
LigandBDBM21333
Substrate/CompetitorBDBM21244
Meas. Tech.Radioligand Binding Assay
Ki 1.4±n/a nM
EC50>10000±n/a nM
Citation Frost, JMDart, MJTietje, KRGarrison, TRGrayson, GKDaza, AVEl-Kouhen, OFMiller, LNLi, LYao, BBHsieh, GCPai, MZhu, CZChandran, PMeyer, MD Indol-3-yl-tetramethylcyclopropyl Ketones: Effects of Indole Ring Substitution on CB2 Cannabinoid Receptor Activity. J Med Chem51:1904-12 (2008) 
 
Cannabinoid receptor 2
Name:Cannabinoid receptor 2
Type:G Protein-Coupled Receptor (GPCR)
Mol. Mass.:39690.94
Organism:Homo sapiens (Human)
Description:P34972
Residue:360
BDBM21333
BDBM21244
NameBDBM21333
Synonyms:Tetrahydropyranyl-methyl analogue, 54 | methyl 1-(oxan-4-ylmethyl)-3-[(2,2,3,3-tetramethylcyclopropyl)carbonyl]-1H-indole-6-carboxylate
TypeSmall organic molecule
Emp. Form.C24H31NO4
Mol. Mass.397.5072
SMILESCOC(=O)c1ccc2c(cn(CC3CCOCC3)c2c1)C(=O)C1C(C)(C)C1(C)C