Reaction Details
TargetOrotidine-5'-phosphate decarboxylase
LigandBDBM21335
Substrate/CompetitorBDBM21336
Meas. Tech.Enzyme Inhibition Assay
pH7.5±n/a
Temperature310.15±n/a K
Ki 26000±2 nM
Citation Bello, AMPoduch, ELiu, YWei, LCrandall, IWang, XDyanand, CKain, KCPai, EFKotra, LP Structure-activity relationships of C6-uridine derivatives targeting plasmodia orotidine monophosphate decarboxylase. J Med Chem51:439-48 (2008) 
 
Orotidine-5'-phosphate decarboxylase
Name:Orotidine-5'-phosphate decarboxylase
Type:Enzyme
Mol. Mass.:37826.43
Organism:Plasmodium falciparum (malaria parasite P. falciparum)
Description:n/a
Residue:323
BDBM21335
BDBM21336
NameBDBM21335
Synonyms:6-cyanouridine 5-monophosphate JMC521648 Compound 34 | {[(2R,3S,4R,5R)-5-(6-cyano-2,4-dioxo-1,2,3,4-tetrahydropyrimidin-1-yl)-3,4-dihydroxyoxolan-2-yl]methoxy}phosphonic acid
TypeSmall organic molecule
Emp. Form.C10H12N3O9P
Mol. Mass.349.1907
SMILESO[C@@H]1[C@@H](COP(O)(O)=O)O[C@H]([C@@H]1O)n1c(cc(=O)[nH]c1=O)C#N