Reaction Details
TargetOrotidine 5'-phosphate decarboxylase
LigandBDBM21337
Substrate/CompetitorBDBM21336
Meas. Tech.Enzyme Inhibition Assay
pH7.5±n/a
Temperature328.15±n/a K
Ki 190±0.01 nM
Citation Bello, AMPoduch, ELiu, YWei, LCrandall, IWang, XDyanand, CKain, KCPai, EFKotra, LP Structure-activity relationships of C6-uridine derivatives targeting plasmodia orotidine monophosphate decarboxylase. J Med Chem51:439-48 (2008) 
 
Orotidine 5'-phosphate decarboxylase
Name:Orotidine 5'-phosphate decarboxylase
Type:Enzyme
Mol. Mass.:24909.45
Organism:Methanobacterium thermoautotrophicum
Description:n/a
Residue:228
BDBM21337
BDBM21336
NameBDBM21337
Synonyms:6-Azido-uridine 5-O-Monophosphate JMC521648 Compound 36 | {[(2R,3S,4R,5R)-5-(6-azido-2,4-dioxo-1,2,3,4-tetrahydropyrimidin-1-yl)-3,4-dihydroxyoxolan-2-yl]methoxy}phosphonic acid
TypeSmall organic molecule
Emp. Form.C9H12N5O9P
Mol. Mass.365.1934
SMILESO[C@@H]1[C@@H](COP(O)(O)=O)O[C@H]([C@@H]1O)n1c(cc(=O)[nH]c1=O)N=[N+]=[N-]