Reaction Details
TargetCarboxypeptidase A1
LigandBDBM21473
Substrate/CompetitorBDBM21477
Meas. Tech.Enzyme Inhibition Assay
Ki 35±n/a nM
Citation Mores, AMatziari, MBeau, FCuniasse, PYiotakis, ADive, V Development of Potent and Selective Phosphinic Peptide Inhibitors of Angiotensin-Converting Enzyme 2. J Med Chem51:2216-2226 (2008) 
 
Carboxypeptidase A1
Name:Carboxypeptidase A1
Type:Enzyme
Mol. Mass.:47073.90
Organism:Bos taurus (bovine)
Description:From Sigma-Aldrich Co.
Residue:419
BDBM21473
BDBM21477
NameBDBM21473
Synonyms:3-{[1-(2-acetamido-4-methylpentanoyl)pyrrolidin-2-yl](hydroxy)phosphoryl}-2-[(3-phenyl-1,2-oxazol-5-yl)methyl]propanoic acid The second fraction of the HPLC chromatogram.
TypeSmall organic molecule
Emp. Form.C25H34N3O7P
Mol. Mass.519.5271
SMILESCC(C)CC(NC(C)=O)C(=O)N1CCC=C1P(O)(O)CC(Cc1cc(no1)-c1ccccc1)C(O)=O