Reaction Details
TargetCarboxypeptidase A1
LigandBDBM21474
Substrate/CompetitorBDBM21477
Meas. Tech.Enzyme Inhibition Assay
Ki 1050±n/a nM
Citation Mores, AMatziari, MBeau, FCuniasse, PYiotakis, ADive, V Development of Potent and Selective Phosphinic Peptide Inhibitors of Angiotensin-Converting Enzyme 2. J Med Chem51:2216-2226 (2008) 
 
Carboxypeptidase A1
Name:Carboxypeptidase A1
Type:Enzyme
Mol. Mass.:47073.90
Organism:Bos taurus (bovine)
Description:From Sigma-Aldrich Co.
Residue:419
BDBM21474
BDBM21477
NameBDBM21474
Synonyms:3-({1-[2-acetamido-3-(1H-imidazol-4-yl)propanoyl]pyrrolidin-2-yl}(hydroxy)phosphoryl)-2-[(3-phenyl-1,2-oxazol-5-yl)methyl]propanoic acid The second fraction of the HPLC chromatogram.
TypeSmall organic molecule
Emp. Form.C25H30N5O7P
Mol. Mass.543.5088
SMILESCC(=O)NC(Cc1cnc[nH]1)C(=O)N1CCC=C1P(O)(O)CC(Cc1cc(no1)-c1ccccc1)C(O)=O