Reaction Details
TargetGlutamate receptor ionotropic, NMDA 1/2B
LigandBDBM276363
Substrate/Competitorn/a
Meas. Tech.NMDA receptor FLIPR assay
IC50 2.00±n/a nM
Citation Chen, GChrovian, CCCoate, HRDvorak, CAGelin, CFHiscox, ALetavic, MARech, JCSoyode-Johnson, AStenne, BWall, JLZhang, W Substituted 1,2,3-triazoles as NR2B-selective NMDA modulators US Patent US10233173 Publication Date 3/19/2019
 
Glutamate receptor ionotropic, NMDA 1/2B
Name:Glutamate receptor ionotropic, NMDA 1/2B
Type:Enzyme
Mol. Mass.:n/a
Description:n/a
Components:This complex has 2 components.
Component 1
Name:Glutamate receptor ionotropic, NMDA 1
Synonyms:GRIN1 Glutamate [NMDA] receptor subunit zeta-1 N-methyl-D-aspartate receptor subunit NR1 NMDZ1_HUMAN | phencyclidine
Type:Enzyme Catalytic Domain
Mol. Mass.:105397.81
Organism:Homo sapiens (Human)
Description:Q05586
Residue:938
Component 2
Name:Glutamate receptor ionotropic, NMDA 2B
Synonyms:GRIN2B Glutamate [NMDA] receptor subunit epsilon 2 N-methyl D-aspartate receptor subtype 2B NMDAR2B NR3 | hNR3
Type:PROTEIN
Mol. Mass.:166375.46
Organism:Homo sapiens (Human)
Description:ChEMBL_1438829
Residue:1484
BDBM276363
NameBDBM276363
Synonyms:2-[[1-[3-(1,1-Difluoroethyl)phenyl]triazol-4-yl]methoxy]-5- US10233173, Example 302
TypeSmall organic molecule
Emp. Form.C16H13F4N5O
Mol. Mass.367.3009
SMILESCC(F)(F)c1cccc(c1)-n1cc(COc2ncc(cn2)C(F)F)nn1