Reaction Details
TargetAngiotensin-converting enzyme
LigandBDBM21638
Substrate/CompetitorBDBM21660
Meas. Tech.In Vitro Inhibition of NEP
Ki 79±n/a nM
Citation Inguimbert, NCoric, PPoras, HMeudal, HTeffot, FFournié-Zaluski, MCRoques, BP Toward an optimal joint recognition of the S1' subsites of endothelin converting enzyme-1 (ECE-1), angiotensin converting enzyme (ACE), and neutral endopeptidase (NEP). J Med Chem45:1477-86 (2002) 
 
Angiotensin-converting enzyme
Name:Angiotensin-converting enzyme
Type:PROTEIN
Mol. Mass.:150907.81
Organism:Rattus norvegicus
Description:ChEMBL_35219
Residue:1313
BDBM21638
BDBM21660
NameBDBM21638
Synonyms:(2S)-3-(1H-indol-3-yl)-2-[3-(naphthalen-1-yl)-2-(sulfanylmethyl)butanamido]propanoic acid racemic mixture
TypeSmall organic molecule
Emp. Form.C26H26N2O3S
Mol. Mass.446.561
SMILESCC(C(CS)C(=O)N[C@@H](Cc1c[nH]c2ccccc12)C(O)=O)c1cccc2ccccc12