Reaction Details
TargetAngiotensin-converting enzyme
LigandBDBM21657
Substrate/CompetitorBDBM21660
Meas. Tech.In Vitro Inhibition of NEP
Ki 76±n/a nM
Citation Inguimbert, NCoric, PPoras, HMeudal, HTeffot, FFournié-Zaluski, MCRoques, BP Toward an optimal joint recognition of the S1' subsites of endothelin converting enzyme-1 (ECE-1), angiotensin converting enzyme (ACE), and neutral endopeptidase (NEP). J Med Chem45:1477-86 (2002) 
 
Angiotensin-converting enzyme
Name:Angiotensin-converting enzyme
Type:PROTEIN
Mol. Mass.:150907.81
Organism:Rattus norvegicus
Description:ChEMBL_35219
Residue:1313
BDBM21657
BDBM21660
NameBDBM21657
Synonyms:(2S)-3-(1H-indol-3-yl)-2-[(2R)-3-sulfanyl-2-[(1R)-1,2,3,4-tetrahydronaphthalen-1-yl]propanamido]propanoic acid | Mercaptoacyl amino acid compound, 14b
TypeSmall organic molecule
Emp. Form.C24H26N2O3S
Mol. Mass.422.54
SMILESOC(=O)[C@H](Cc1c[nH]c2ccccc12)NC(=O)[C@H](CS)[C@H]1CCCc2ccccc12