Reaction Details
TargetEndothelin-converting enzyme 1
LigandBDBM21644
Substrate/CompetitorBDBM21661
Meas. Tech.In Vitro Inhibition of NEP
Ki 100±n/a nM
Citation Inguimbert, NCoric, PPoras, HMeudal, HTeffot, FFournié-Zaluski, MCRoques, BP Toward an optimal joint recognition of the S1' subsites of endothelin converting enzyme-1 (ECE-1), angiotensin converting enzyme (ACE), and neutral endopeptidase (NEP). J Med Chem45:1477-86 (2002) 
 
Endothelin-converting enzyme 1
Name:Endothelin-converting enzyme 1
Type:Enzyme
Mol. Mass.:87155.11
Organism:Homo sapiens (Human)
Description:P42892
Residue:770
BDBM21644
BDBM21661
NameBDBM21644
Synonyms:(2S)-3-(1H-indol-3-yl)-2-[(2S,3S)-3-phenyl-2-(sulfanylmethyl)butanamido]propanoic acid | Mercaptoacyl amino acid compound, 9a
TypeSmall organic molecule
Emp. Form.C22H24N2O3S
Mol. Mass.396.503
SMILESC[C@@H]([C@H](CS)C(=O)N[C@@H](Cc1c[nH]c2ccccc12)C(O)=O)c1ccccc1