Reaction Details
TargetCyclin-dependent kinase 6/G1/S-specific cyclin-D1
LigandBDBM370119
Substrate/Competitorn/a
Meas. Tech.CDK6/Cyclin D1 Mobility Shift Assay
Ki 0.130±n/a nM
Citation Freeman-Cook, KDHoffman, RLNagata, ANinkovic, S CDK2/4/6 inhibitors US Patent US10233188 Publication Date 3/19/2019
 
Cyclin-dependent kinase 6/G1/S-specific cyclin-D1
Name:Cyclin-dependent kinase 6/G1/S-specific cyclin-D1
Synonyms:CDK6/Cyclin D1
Type:Enzyme
Mol. Mass.:n/a
Description:n/a
Components:This complex has 2 components.
Component 1
Name:Cyclin-dependent kinase 6
Type:Enzyme Subunit
Mol. Mass.:36937.42
Organism:Homo sapiens (Human)
Description:Q00534
Residue:326
Component 2
Name:G1/S-specific cyclin-D1
Synonyms:CCND1_MOUSE Cyclin D1 | Cyl-1
Type:Enzyme Subunit
Mol. Mass.:33418.84
Organism:Mus musculus (mouse)
Description:n/a
Residue:295
BDBM370119
NameBDBM370119
Synonyms:US10233188, Example 8
TypeSmall organic molecule
Emp. Form.C21H30F2N6O4S
Mol. Mass.500.563
SMILESCNS(=O)(=O)N1CCC(CC1)Nc1ncc2cc(CC(F)F)c(=O)n([C@@H]3CCC[C@@]3(C)O)c2n1