Reaction Details
TargetPhosphatidylinositol 4,5-bisphosphate 3-kinase catalytic subunit beta/delta isoform
LigandBDBM261161
Substrate/Competitorn/a
Meas. Tech.A2 PI3Kdelta Scintillation Proximity Assay
pH6.7±n/a
Temperature298.15±n/a K
IC50<10±n/a nM
Commentsextracted
Citation Li, YCombs, APYue, EWDouty, BMei, S Heterocyclylamines as PI3K inhibitors US Patent US9707233 Publication Date 7/18/2017
 
Phosphatidylinositol 4,5-bisphosphate 3-kinase catalytic subunit beta/delta isoform
Name:Phosphatidylinositol 4,5-bisphosphate 3-kinase catalytic subunit beta/delta isoform
Type:Protein
Mol. Mass.:n/a
Description:n/a
Components:This complex has 2 components.
Component 1
Name:Phosphatidylinositol 4,5-bisphosphate 3-kinase catalytic subunit delta isoform
Synonyms:PI3-kinase p110 subunit delta PI3-kinase subunit p110-delta PIK3CD Phosphatidylinositol 4,5-biphosphate 3-kinase catalytic subunit delta (PIK3CD) Phosphatidylinositol 4,5-bisphosphate 3-kinase 110 kDa catalytic subunit delta (PI3K delta) Phosphatidylinositol 4,5-bisphosphate 3-kinase catalytic subunit delta (PI3Kdelta) Phosphatidylinositol 4,5-bisphosphate 3-kinase catalytic subunit delta isoform (PI3K delta) Phosphatidylinositol 4,5-bisphosphate 3-kinase catalytic subunit delta isoform (PI3K-delta) Phosphatidylinositol 4,5-bisphosphate 3-kinase catalytic subunit delta isoform (PI3Kdelta)
Type:Enzyme Subunit
Mol. Mass.:119489.41
Organism:Homo sapiens (Human)
Description:O00329
Residue:1044
Component 2
Name:Phosphatidylinositol 4,5-bisphosphate 3-kinase catalytic subunit beta isoform
Synonyms:PI3-kinase p110 subunit beta PI3Kbeta PIK3CB Phosphatidylinositol 4,5-bisphosphate 3-kinase catalytic subunit beta (PI3Kbeta) Phosphatidylinositol 4,5-bisphosphate 3-kinase catalytic subunit beta isoform (PI3K) Phosphatidylinositol 4,5-bisphosphate 3-kinase catalytic subunit beta isoform (PI3Kbeta) Phosphatidylinositol-4,5-bisphosphate 3-kinase catalytic subunit beta isoform Phosphoinositide 3-Kinase (PI3K), beta Chain A PtdIns-3-kinase p110
Type:Enzyme Subunit
Mol. Mass.:122769.00
Organism:Homo sapiens (Human)
Description:P42338
Residue:1070
BDBM261161
NameBDBM261161
Synonyms:2-[(5-{3-[1-(4-Amino-3-methyl-1H-pyrazolo[3,4-d]pyrimidin-1-yl)ethyl]-5-chloro-2-methoxy-6-methylphenyl}pyridin-2-yl)amino]ethanol US11433071, Example 184 US9730939, Example 184
TypeSmall organic molecule
Emp. Form.C23H28ClN7O2
Mol. Mass.469.967
SMILESCOc1c(cc(Cl)c(C)c1-c1ccc(NCCO)nc1)C(C)Nc1ncnc(N)c1C(C)=N