Reaction Details
TargetMonocarboxylate transporter 1
LigandBDBM21987
Substrate/CompetitorBDBM21986
Meas. Tech.Radioligand Filter Binding Assay
pH7.8±n/a
Temperature295.15±n/a K
Ki 0.81±n/a nM
Citation Guile, SDBantick, JRCooper, MEDonald, DKEyssade, CIngall, AHLewis, RJMartin, BPMohammed, RTPotter, TJReynolds, RHSt-Gallay, SAWright, AD Optimization of monocarboxylate transporter 1 blockers through analysis and modulation of atropisomer interconversion properties. J Med Chem50:254-63 (2007) 
 
Monocarboxylate transporter 1
Name:Monocarboxylate transporter 1
Type:PROTEIN
Mol. Mass.:53956.64
Organism:Homo sapiens (Human)
Description:ChEMBL_1451367
Residue:500
BDBM21987
BDBM21986
NameBDBM21987
Synonyms:6-[(6-fluoroquinolin-4-yl)methyl]-5-{[(3R)-3-hydroxypyrrolidin-1-yl]carbonyl}-3-methyl-1-(2-methylpropyl)-1H,2H,3H,4H-thieno[2,3-d]pyrimidine-2,4-dione | Thienopyrimidine-2,4-dione, 2
TypeSmall organic molecule
Emp. Form.C26H27FN4O4S
Mol. Mass.510.58
SMILESCC(C)Cn1c2sc(Cc3ccnc4ccc(F)cc34)c(C(=O)N3CC[C@@H](O)C3)c2c(=O)n(C)c1=O