Reaction Details
TargetMonocarboxylate transporter 1
LigandBDBM21993
Substrate/CompetitorBDBM21986
Meas. Tech.Radioligand Filter Binding Assay
pH7.8±n/a
Temperature295.15±n/a K
Ki 3.2±n/a nM
Citation Guile, SDBantick, JRCooper, MEDonald, DKEyssade, CIngall, AHLewis, RJMartin, BPMohammed, RTPotter, TJReynolds, RHSt-Gallay, SAWright, AD Optimization of monocarboxylate transporter 1 blockers through analysis and modulation of atropisomer interconversion properties. J Med Chem50:254-63 (2007) 
 
Monocarboxylate transporter 1
Name:Monocarboxylate transporter 1
Type:PROTEIN
Mol. Mass.:53956.64
Organism:Homo sapiens (Human)
Description:ChEMBL_1451367
Residue:500
BDBM21993
BDBM21986
NameBDBM21993
Synonyms:6-[(4,5-dichloro-2-methyl-1H-imidazol-1-yl)methyl]-N-methoxy-N,3-dimethyl-1-(2-methylpropyl)-2,4-dioxo-1H,2H,3H,4H-thieno[2,3-d]pyrimidine-5-carboxamide | Thienopyrimidine-2,4-dione, 8
TypeSmall organic molecule
Emp. Form.C19H23Cl2N5O4S
Mol. Mass.488.388
SMILESCON(C)C(=O)c1c(Cn2c(C)nc(Cl)c2Cl)sc2n(CC(C)C)c(=O)n(C)c(=O)c12