Reaction Details
TargetMonocarboxylate transporter 1
LigandBDBM21996
Substrate/CompetitorBDBM21986
Meas. Tech.Radioligand Filter Binding Assay
pH7.8±n/a
Temperature295.15±n/a K
Ki 0.43±n/a nM
Citation Guile, SDBantick, JRCooper, MEDonald, DKEyssade, CIngall, AHLewis, RJMartin, BPMohammed, RTPotter, TJReynolds, RHSt-Gallay, SAWright, AD Optimization of monocarboxylate transporter 1 blockers through analysis and modulation of atropisomer interconversion properties. J Med Chem50:254-63 (2007) 
 
Monocarboxylate transporter 1
Name:Monocarboxylate transporter 1
Type:PROTEIN
Mol. Mass.:53956.64
Organism:Homo sapiens (Human)
Description:ChEMBL_1451367
Residue:500
BDBM21996
BDBM21986
NameBDBM21996
Synonyms:5-{[(4S)-4-hydroxy-1,2-oxazolidin-2-yl]carbonyl}-3-methyl-1-(2-methylpropyl)-6-{1H-pyrrolo[2,3-b]pyridin-3-ylmethyl}-1H,2H,3H,4H-thieno[2,3-d]pyrimidine-2,4-dione | Thienopyrimidine-2,4-dione, 11
TypeSmall organic molecule
Emp. Form.C23H25N5O5S
Mol. Mass.483.54
SMILESCC(C)Cn1c2sc(Cc3c[nH]c4ncccc34)c(C(=O)N3C[C@H](O)CO3)c2c(=O)n(C)c1=O