Reaction Details
TargetNitric oxide synthase, brain [D597N]
LigandBDBM21960
Substrate/CompetitorBDBM21959
Meas. Tech.NOS Enzyme Inhibition Assay
pH7.5±n/a
Temperature303.15±n/a K
Ki 34000±n/a nM
Citation Flinspach, MLLi, HJamal, JYang, WHuang, HHah, JMGiómez-Vidal, JALitzinger, EASilverman, RBPoulos, TL Structural basis for dipeptide amide isoform-selective inhibition of neuronal nitric oxide synthase. Nat Struct Mol Biol11:54-9 (2004) 
 
Nitric oxide synthase, brain [D597N]
Name:Nitric oxide synthase, brain [D597N]
Type:Enzyme
Mol. Mass.:160571.01
Organism:Rattus norvegicus (rat)
Description:Recombinant enzyme overexpressed in E. coli.
Residue:1429
BDBM21960
BDBM21959
NameBDBM21960
Synonyms:3-[(4S)-4-amino-5-[(2-aminoethyl)amino]pentyl]-1-nitroguanidine JMC522060 Compound 2 | N omega-Nitro-L-Arginine-Containing Dipeptide, 1
Typen/a
Emp. Form.C8H21N7O2
Mol. Mass.247.298
SMILESNCCNC[C@@H](N)CCCN=C(N)N[N+]([O-])=O