Reaction Details
TargetCathepsin B-like cysteine protease
LigandBDBM22051
Substrate/CompetitorBDBM22047
Meas. Tech.Enzyme Inhibition Assay
pH5.5±n/a
Temperature295.15±n/a K
IC50 2300±200 nM
Citation Mallari, JPShelat, AAObrien, TCaffrey, CRKosinski, AConnelly, MHarbut, MGreenbaum, DMcKerrow, JHGuy, RK Development of potent purine-derived nitrile inhibitors of the trypanosomal protease TbcatB. J Med Chem51:545-52 (2008) 
 
Cathepsin B-like cysteine protease
Name:Cathepsin B-like cysteine protease
Type:Enzyme
Mol. Mass.:37220.37
Organism:Trypanosoma brucei
Description:Enzyme was expressed in yeast Pichia pastoris.
Residue:340
BDBM22051
BDBM22047
NameBDBM22051
Synonyms:9-benzyl-6-(cyclohexylamino)-9H-purine-2-carbonitrile | Compound 3{2,17}
TypeSmall organic molecule
Emp. Form.C19H20N6
Mol. Mass.332.4023
SMILESN#Cc1nc(NC2CCCCC2)c2ncn(Cc3ccccc3)c2n1