Reaction Details
TargetCathepsin B-like cysteine protease
LigandBDBM22057
Substrate/CompetitorBDBM22047
Meas. Tech.Enzyme Inhibition Assay
pH5.5±n/a
Temperature295.15±n/a K
IC50>25000±n/a nM
Citation Mallari, JPShelat, AAObrien, TCaffrey, CRKosinski, AConnelly, MHarbut, MGreenbaum, DMcKerrow, JHGuy, RK Development of potent purine-derived nitrile inhibitors of the trypanosomal protease TbcatB. J Med Chem51:545-52 (2008) 
 
Cathepsin B-like cysteine protease
Name:Cathepsin B-like cysteine protease
Type:Enzyme
Mol. Mass.:37220.37
Organism:Trypanosoma brucei
Description:Enzyme was expressed in yeast Pichia pastoris.
Residue:340
BDBM22057
BDBM22047
NameBDBM22057
Synonyms:9-cyclopentyl-6-{[(1R)-1-phenylethyl]amino}-9H-purine-2-carbonitrile | Compound 3{4,13}
TypeSmall organic molecule
Emp. Form.C19H20N6
Mol. Mass.332.4023
SMILESC[C@@H](Nc1nc(nc2n(cnc12)C1CCCC1)C#N)c1ccccc1