Reaction Details
TargetCathepsin B-like cysteine protease
LigandBDBM22082
Substrate/CompetitorBDBM22047
Meas. Tech.Enzyme Inhibition Assay
Temperature298.15±n/a K
IC50 2800±n/a nM
Commentsextracted
Citation Mallari, JPShelat, AAObrien, TCaffrey, CRKosinski, AConnelly, MHarbut, MGreenbaum, DMcKerrow, JHGuy, RK Development of potent purine-derived nitrile inhibitors of the trypanosomal protease TbcatB. J Med Chem51:545-52 (2008) 
 
Cathepsin B-like cysteine protease
Name:Cathepsin B-like cysteine protease
Type:Enzyme
Mol. Mass.:37220.37
Organism:Trypanosoma brucei
Description:Enzyme was expressed in yeast Pichia pastoris.
Residue:340
BDBM22082
BDBM22047
NameBDBM22082
Synonyms:6-(benzylamino)-9-{[3-(trifluoromethyl)phenyl]methyl}-9H-purine-2-carbonitrile | Compound 3{8,18}
TypeSmall organic molecule
Emp. Form.C21H15F3N6
Mol. Mass.408.3792
SMILESFC(F)(F)c1cccc(Cn2cnc3c(NCc4ccccc4)nc(nc23)C#N)c1