Reaction Details
TargetCathepsin B-like cysteine protease
LigandBDBM22091
Substrate/CompetitorBDBM22047
Meas. Tech.Enzyme Inhibition Assay
Temperature298.15±n/a K
IC50 8400±n/a nM
Commentsextracted
Citation Mallari, JPShelat, AAObrien, TCaffrey, CRKosinski, AConnelly, MHarbut, MGreenbaum, DMcKerrow, JHGuy, RK Development of potent purine-derived nitrile inhibitors of the trypanosomal protease TbcatB. J Med Chem51:545-52 (2008) 
 
Cathepsin B-like cysteine protease
Name:Cathepsin B-like cysteine protease
Type:Enzyme
Mol. Mass.:37220.37
Organism:Trypanosoma brucei
Description:Enzyme was expressed in yeast Pichia pastoris.
Residue:340
BDBM22091
BDBM22047
NameBDBM22091
Synonyms:6-{[(4-bromophenyl)methyl]amino}-9-butyl-9H-purine-2-carbonitrile | Compound 3{11,12}
TypeSmall organic molecule
Emp. Form.C17H17BrN6
Mol. Mass.385.261
SMILESCCCCn1cnc2c(NCc3ccc(Br)cc3)nc(nc12)C#N