Reaction Details
TargetCathepsin B-like cysteine protease
LigandBDBM22093
Substrate/CompetitorBDBM22047
Meas. Tech.Enzyme Inhibition Assay
Temperature298.15±n/a K
IC50>25000±n/a nM
Commentsextracted
Citation Mallari, JPShelat, AAObrien, TCaffrey, CRKosinski, AConnelly, MHarbut, MGreenbaum, DMcKerrow, JHGuy, RK Development of potent purine-derived nitrile inhibitors of the trypanosomal protease TbcatB. J Med Chem51:545-52 (2008) 
 
Cathepsin B-like cysteine protease
Name:Cathepsin B-like cysteine protease
Type:Enzyme
Mol. Mass.:37220.37
Organism:Trypanosoma brucei
Description:Enzyme was expressed in yeast Pichia pastoris.
Residue:340
BDBM22093
BDBM22047
NameBDBM22093
Synonyms:6-{[(4-bromophenyl)methyl]amino}-9-(3-phenylpropyl)-9H-purine-2-carbonitrile | Compound 3{11,19}
TypeSmall organic molecule
Emp. Form.C22H19BrN6
Mol. Mass.447.33
SMILESBrc1ccc(CNc2nc(nc3n(CCCc4ccccc4)cnc23)C#N)cc1