Reaction Details
TargetPurine nucleoside phosphorylase
LigandBDBM22108
Substrate/CompetitorBDBM22104
Meas. Tech.PNP Inhibition Assay
pH7.7±n/a
Temperature295.15±n/a K
Ki 1.8±0.3 nM
Km40000±n/a nM
CommentsKi is the dissociation constant for the first step in the two-step binding characteristic of slow-onset tight-binding inhibition.
Citation Evans, GBFurneaux, RHGreatrex, BMurkin, ASSchramm, VLTyler, PC Azetidine based transition state analogue inhibitors of N-ribosyl hydrolases and phosphorylases. J Med Chem51:948-56 (2008) 
 
Purine nucleoside phosphorylase
Name:Purine nucleoside phosphorylase
Type:Enzyme
Mol. Mass.:32119.53
Organism:Homo sapiens (Human)
Description:n/a
Residue:289
BDBM22108
BDBM22104
NameBDBM22108
Synonyms:7-{[2-(hydroxymethyl)azetidin-1-yl]methyl}-3H,4H,5H-pyrrolo[3,2-d]pyrimidin-4-one | Azetidine based compound, (+/-) 42
TypeSmall organic molecule
Emp. Form.C11H14N4O2
Mol. Mass.234.2545
SMILESOCC1CCN1Cc1c[nH]c2c1nc[nH]c2=O