Reaction Details
TargetProto-oncogene tyrosine-protein kinase Src
LigandBDBM340129
Substrate/Competitorn/a
Meas. Tech.Src Enzyme Activity
EC50>1000±n/a nM
Citation Barf, TAJans, CGde Man, APOubrie, AARaaijmakers, HCRewinkel, JBSterrenburg, JGWijkmans, JC 4-imidazopyridazin-1-yl-benzamides as BTK inhibitors US Patent US10239883 Publication Date 3/26/2019
 
Proto-oncogene tyrosine-protein kinase Src
Name:Proto-oncogene tyrosine-protein kinase Src
Type:Protein
Mol. Mass.:59838.60
Organism:Homo sapiens (Human)
Description:P12931
Residue:536
BDBM340129
NameBDBM340129
Synonyms:US10239883, Example 17 US9758524, Example 17
TypeSmall organic molecule
Emp. Form.C26H24FN7O2
Mol. Mass.485.5129
SMILESNc1nccn2c(nc(-c3ccc(cc3)C(=O)Nc3cc(F)ccn3)c12)[C@@H]1CCCCN1C(=O)C=C