Reaction Details
TargetTyrosine-protein kinase Fyn
LigandBDBM340130
Substrate/Competitorn/a
Meas. Tech.FynT Enzyme Activity
EC50>1000±n/a nM
Citation Barf, TAJans, CGde Man, APOubrie, AARaaijmakers, HCRewinkel, JBSterrenburg, JGWijkmans, JC 4-imidazopyridazin-1-yl-benzamides as BTK inhibitors US Patent US10239883 Publication Date 3/26/2019
 
Tyrosine-protein kinase Fyn
Name:Tyrosine-protein kinase Fyn
Type:Enzyme
Mol. Mass.:60762.21
Organism:Homo sapiens (Human)
Description:P06241
Residue:537
BDBM340130
NameBDBM340130
Synonyms:US10239883, Example 18 US9758524, Example 18
TypeSmall organic molecule
Emp. Form.C27H24N8O2
Mol. Mass.492.5319
SMILESNc1nccn2c(nc(-c3ccc(cc3)C(=O)Nc3cc(ccn3)C#N)c12)[C@@H]1CCCCN1C(=O)C=C