Reaction Details
TargetTyrosine-protein kinase Fyn
LigandBDBM340140
Substrate/Competitorn/a
Meas. Tech.FynT Enzyme Activity
EC50>1000±n/a nM
Citation Barf, TAJans, CGde Man, APOubrie, AARaaijmakers, HCRewinkel, JBSterrenburg, JGWijkmans, JC 4-imidazopyridazin-1-yl-benzamides as BTK inhibitors US Patent US10239883 Publication Date 3/26/2019
 
Tyrosine-protein kinase Fyn
Name:Tyrosine-protein kinase Fyn
Type:Enzyme
Mol. Mass.:60762.21
Organism:Homo sapiens (Human)
Description:P06241
Residue:537
BDBM340140
NameBDBM340140
Synonyms:US10239883, Example 29 US9758524, Example 29
TypeSmall organic molecule
Emp. Form.C22H19N7O2
Mol. Mass.413.432
SMILESNc1nccn2c(CNC(=O)C=C)nc(-c3ccc(cc3)C(=O)Nc3ccccn3)c12