Reaction Details
TargetTyrosine-protein kinase Lyn
LigandBDBM340089
Substrate/Competitorn/a
Meas. Tech.Lyn Enzyme Activity
EC50>1000±n/a nM
Citation Barf, TAJans, CGde Man, APOubrie, AARaaijmakers, HCRewinkel, JBSterrenburg, JGWijkmans, JC 4-imidazopyridazin-1-yl-benzamides as BTK inhibitors US Patent US10239883 Publication Date 3/26/2019
 
Tyrosine-protein kinase Lyn
Name:Tyrosine-protein kinase Lyn
Type:Protein
Mol. Mass.:58575.92
Organism:Homo sapiens (Human)
Description:P07948
Residue:512
BDBM340089
NameBDBM340089
Synonyms:(S)-4-(8-amino-3-(1-but-2- ynoylpyrrolidin-2-yl)imidazo[1,5- a]pyrazin-1-yl)-2-fluoro-N-(pyridin- 2-yl)benzamide US10934296, Example 50 | US9758524, Example 50
TypeSmall organic molecule
Emp. Form.C26H22FN7O2
Mol. Mass.483.497
SMILESCC#CC(=O)N1CCC[C@H]1c1nc(-c2ccc(C(=O)Nc3ccccn3)c(F)c2)c2c(N)nccn12