Reaction Details
TargetRAF proto-oncogene serine/threonine-protein kinase
LigandBDBM202697
Substrate/Competitorn/a
Meas. Tech.In Vitro Raf Activity
IC50 0.090±n/a nM
Citation Aversa, RJBarsanti, PABurger, MTDillon, MPDipesa, AHu, CLou, YNishiguchi, GAPan, YPolyakov, VRRamurthy, SRico, ACSetti, LQSmith, ASubramanian, STaft, BRTanner, HRWan, LYusuff, N Biaryl amide compounds as kinase inhibitors US Patent US10245267 Publication Date 4/2/2019
 
RAF proto-oncogene serine/threonine-protein kinase
Name:RAF proto-oncogene serine/threonine-protein kinase
Type:Serine/threonine-protein kinase
Mol. Mass.:73082.52
Organism:Homo sapiens (Human)
Description:P04049
Residue:648
BDBM202697
NameBDBM202697
Synonyms:US10245267, Example 42 US9242969, 43
TypeSmall organic molecule
Emp. Form.C26H25F3N4O2
Mol. Mass.482.4975
SMILESCC(=C)c1cc(nc(n1)-c1cc(NC(=O)c2cccc(c2)C(F)(F)F)ccc1C)N1CCOCC1