Reaction Details
TargetRAF proto-oncogene serine/threonine-protein kinase
LigandBDBM202729
Substrate/Competitorn/a
Meas. Tech.In Vitro Raf Activity
IC50 0.056±n/a nM
Citation Aversa, RJBarsanti, PABurger, MTDillon, MPDipesa, AHu, CLou, YNishiguchi, GAPan, YPolyakov, VRRamurthy, SRico, ACSetti, LQSmith, ASubramanian, STaft, BRTanner, HRWan, LYusuff, N Biaryl amide compounds as kinase inhibitors US Patent US10245267 Publication Date 4/2/2019
 
RAF proto-oncogene serine/threonine-protein kinase
Name:RAF proto-oncogene serine/threonine-protein kinase
Type:Serine/threonine-protein kinase
Mol. Mass.:73082.52
Organism:Homo sapiens (Human)
Description:P04049
Residue:648
BDBM202729
NameBDBM202729
Synonyms:US10245267, Example 75 US9242969, 75 | US9694016, 75
TypeSmall organic molecule
Emp. Form.C24H23F2N3O2
Mol. Mass.423.4551
SMILESCc1ccc(NC(=O)c2cccc(c2)C(F)F)cc1-c1ccnc(c1)N1CCOCC1