Reaction Details
TargetSerine/threonine-protein kinase B-raf [V600E]
LigandBDBM202682
Substrate/Competitorn/a
Meas. Tech.In Vitro Raf Activity
IC50 0.900±n/a nM
Citation Aversa, RJBarsanti, PABurger, MTDillon, MPDipesa, AHu, CLou, YNishiguchi, GAPan, YPolyakov, VRRamurthy, SRico, ACSetti, LQSmith, ASubramanian, STaft, BRTanner, HRWan, LYusuff, N Biaryl amide compounds as kinase inhibitors US Patent US10245267 Publication Date 4/2/2019
 
Serine/threonine-protein kinase B-raf [V600E]
Name:Serine/threonine-protein kinase B-raf [V600E]
Type:n/a
Mol. Mass.:84474.98
Organism:Homo sapiens (Human)
Description:P15056 V600E
Residue:766
BDBM202682
NameBDBM202682
Synonyms:US10245267, Example 38 US9242969, 27 | US9694016, 27
TypeSmall organic molecule
Emp. Form.C24H23F3N4O4S
Mol. Mass.520.524
SMILESCc1ccc(NC(=O)c2cccc(c2)C(F)(F)F)cc1-c1cc(nc(n1)S(C)(=O)=O)N1CCOCC1