Reaction Details
TargetRAF proto-oncogene serine/threonine-protein kinase
LigandBDBM81181
Substrate/Competitorn/a
Meas. Tech.In Vitro Raf Activity
IC50 0.100±n/a nM
Citation Aversa, RJBarsanti, PABurger, MTDillon, MPDipesa, AHu, CLou, YNishiguchi, GAPan, YPolyakov, VRRamurthy, SRico, ACSetti, LQSmith, ASubramanian, STaft, BRTanner, HRWan, LYusuff, N Biaryl amide compounds as kinase inhibitors US Patent US10245267 Publication Date 4/2/2019
 
RAF proto-oncogene serine/threonine-protein kinase
Name:RAF proto-oncogene serine/threonine-protein kinase
Type:Serine/threonine-protein kinase
Mol. Mass.:73082.52
Organism:Homo sapiens (Human)
Description:P04049
Residue:648
BDBM81181
NameBDBM81181
Synonyms:US10245267, Example 480 US9694016, 480
TypeSmall organic molecule
Emp. Form.C27H27N5O3
Mol. Mass.469.535
SMILESCc1ccc(NC(=O)c2ccnc(c2)C2(CC2)C#N)cc1-c1cc(N2CCOCC2)n(C)c(=O)c1