Reaction Details
TargetRAF proto-oncogene serine/threonine-protein kinase
LigandBDBM84273
Substrate/Competitorn/a
Meas. Tech.In Vitro Raf Activity
IC50 0.100±n/a nM
Citation Aversa, RJBarsanti, PABurger, MTDillon, MPDipesa, AHu, CLou, YNishiguchi, GAPan, YPolyakov, VRRamurthy, SRico, ACSetti, LQSmith, ASubramanian, STaft, BRTanner, HRWan, LYusuff, N Biaryl amide compounds as kinase inhibitors US Patent US10245267 Publication Date 4/2/2019
 
RAF proto-oncogene serine/threonine-protein kinase
Name:RAF proto-oncogene serine/threonine-protein kinase
Type:Serine/threonine-protein kinase
Mol. Mass.:73082.52
Organism:Homo sapiens (Human)
Description:P04049
Residue:648
BDBM84273
NameBDBM84273
Synonyms:US10245267, Example 561 US9694016, 561
TypeSmall organic molecule
Emp. Form.C25H26F2N4O3
Mol. Mass.468.4957
SMILESCCOc1nnc(cc1N1CCOCC1)-c1cc(NC(=O)c2cccc(c2)C(F)F)ccc1C