Reaction Details
TargetRAF proto-oncogene serine/threonine-protein kinase
LigandBDBM87369
Substrate/Competitorn/a
Meas. Tech.In Vitro Raf Activity
IC50 0.080±n/a nM
Citation Aversa, RJBarsanti, PABurger, MTDillon, MPDipesa, AHu, CLou, YNishiguchi, GAPan, YPolyakov, VRRamurthy, SRico, ACSetti, LQSmith, ASubramanian, STaft, BRTanner, HRWan, LYusuff, N Biaryl amide compounds as kinase inhibitors US Patent US10245267 Publication Date 4/2/2019
 
RAF proto-oncogene serine/threonine-protein kinase
Name:RAF proto-oncogene serine/threonine-protein kinase
Type:Serine/threonine-protein kinase
Mol. Mass.:73082.52
Organism:Homo sapiens (Human)
Description:P04049
Residue:648
BDBM87369
NameBDBM87369
Synonyms:US10245267, Example 704 US9694016, 704
TypeSmall organic molecule
Emp. Form.C25H29N5O4S
Mol. Mass.495.594
SMILESCCNc1nc(cc(n1)-c1cc(NC(=O)c2cccc(c2)S(C)(=O)=O)ccc1C)N1CCOCC1