Reaction Details
TargetRAF proto-oncogene serine/threonine-protein kinase
LigandBDBM87818
Substrate/Competitorn/a
Meas. Tech.In Vitro Raf Activity
IC50 0.100±n/a nM
Citation Aversa, RJBarsanti, PABurger, MTDillon, MPDipesa, AHu, CLou, YNishiguchi, GAPan, YPolyakov, VRRamurthy, SRico, ACSetti, LQSmith, ASubramanian, STaft, BRTanner, HRWan, LYusuff, N Biaryl amide compounds as kinase inhibitors US Patent US10245267 Publication Date 4/2/2019
 
RAF proto-oncogene serine/threonine-protein kinase
Name:RAF proto-oncogene serine/threonine-protein kinase
Type:Serine/threonine-protein kinase
Mol. Mass.:73082.52
Organism:Homo sapiens (Human)
Description:P04049
Residue:648
BDBM87818
NameBDBM87818
Synonyms:US10245267, Example 848 US9694016, 848
TypeSmall organic molecule
Emp. Form.C26H24F2N4O2
Mol. Mass.462.4912
SMILESCc1ccc(NC(=O)c2cccc(c2)C(F)F)cc1-c1cc(N2CCOCC2)c2nccn2c1