Reaction Details
TargetRAF proto-oncogene serine/threonine-protein kinase
LigandBDBM87829
Substrate/Competitorn/a
Meas. Tech.In Vitro Raf Activity
IC50 0.080±n/a nM
Citation Aversa, RJBarsanti, PABurger, MTDillon, MPDipesa, AHu, CLou, YNishiguchi, GAPan, YPolyakov, VRRamurthy, SRico, ACSetti, LQSmith, ASubramanian, STaft, BRTanner, HRWan, LYusuff, N Biaryl amide compounds as kinase inhibitors US Patent US10245267 Publication Date 4/2/2019
 
RAF proto-oncogene serine/threonine-protein kinase
Name:RAF proto-oncogene serine/threonine-protein kinase
Type:Serine/threonine-protein kinase
Mol. Mass.:73082.52
Organism:Homo sapiens (Human)
Description:P04049
Residue:648
BDBM87829
NameBDBM87829
Synonyms:US10245267, Example 857 US9694016, 857
TypeSmall organic molecule
Emp. Form.C25H23F3N4O4S
Mol. Mass.532.535
SMILESCc1ccc(NC(=O)c2cccc(c2)C(F)(F)F)cc1-c1nc2CCS(=O)(=O)c2c(n1)N1CCOCC1