Reaction Details
TargetRAF proto-oncogene serine/threonine-protein kinase
LigandBDBM88127
Substrate/Competitorn/a
Meas. Tech.In Vitro Raf Activity
IC50 0.070±n/a nM
Citation Aversa, RJBarsanti, PABurger, MTDillon, MPDipesa, AHu, CLou, YNishiguchi, GAPan, YPolyakov, VRRamurthy, SRico, ACSetti, LQSmith, ASubramanian, STaft, BRTanner, HRWan, LYusuff, N Biaryl amide compounds as kinase inhibitors US Patent US10245267 Publication Date 4/2/2019
 
RAF proto-oncogene serine/threonine-protein kinase
Name:RAF proto-oncogene serine/threonine-protein kinase
Type:Serine/threonine-protein kinase
Mol. Mass.:73082.52
Organism:Homo sapiens (Human)
Description:P04049
Residue:648
BDBM88127
NameBDBM88127
Synonyms:US10245267, Example 1162 US9694016, 1162
TypeSmall organic molecule
Emp. Form.C26H29N5O4
Mol. Mass.475.5396
SMILESCc1ccc(NC(=O)c2cnnc(c2)C2CC2)cc1-c1cc(OCCO)nc(c1)N1CCOCC1