Reaction Details
TargetEstrogen receptor
LigandBDBM22435
Substrate/Competitor[3H]]estradiol
Meas. Tech.Radioligand Displacement Assay
pH7.4±n/a
Temperature295.15±n/a K
IC50 320 ±n/a nM
Citation Chao, EYCollins, JLGaillard, SMiller, ABWang, LOrband-Miller, LANolte, RTMcDonnell, DPWillson, TMZuercher, WJ Structure-guided synthesis of tamoxifen analogs with improved selectivity for the orphan ERRgamma. Bioorg Med Chem Lett16:821-4 (2006) 
 
Estrogen receptor
Name:Estrogen receptor
Type:Protein
Mol. Mass.:66230.44
Organism:Homo sapiens (Human)
Description:P03372
Residue:595
BDBM22435
[3H]]estradiol
NameBDBM22435
Synonyms:4-[(1Z)-1-{4-[2-(dimethylamino)ethoxy]phenyl}-5-hydroxy-2-phenylpent-1-en-1-yl]phenol GSK 5182 US11285226, Compound GSK5182
TypeSmall organic molecule
Emp. Form.C27H31NO3
Mol. Mass.417.5399
SMILESCN(C)CCOc1ccc(cc1)C(=C(\CCCO)c1ccccc1)\c1ccc(O)cc1