Reaction Details
TargetHistone deacetylase 1
LigandBDBM22449
Substrate/CompetitorBDBM22448
Meas. Tech.Enzyme Inhibition Assay
pH7.4±n/a
Temperature295.15±n/a K
Ki 995±n/a nM
Citation Estiu, GGreenberg, EHarrison, CBKwiatkowski, NPMazitschek, RBradner, JEWiest, O Structural Origin of Selectivity in Class II-Selective Histone Deacetylase Inhibitors. J Med Chem51:2898-906 (2008) 
 
Histone deacetylase 1
Name:Histone deacetylase 1
Type:Enzyme
Mol. Mass.:55090.27
Organism:Homo sapiens (Human)
Description:Q13547
Residue:482
BDBM22449
BDBM22448
NameBDBM22449
Synonyms:CHEMBL356769 Tubacin | US9249087, Tubastatin A
TypeSmall organic molecule
Emp. Form.C41H43N3O7S
Mol. Mass.721.861
SMILESOCc1ccc(cc1)[C@@H]1C[C@H](CSc2nc(c(o2)-c2ccccc2)-c2ccccc2)O[C@@H](O1)c1ccc(NC(=O)CCCCCCC(=O)NO)cc1