Reaction Details
TargetGenome polyprotein
LigandBDBM70681
Substrate/Competitorn/a
Meas. Tech.Pseudotyped HCV particle (HCVpp) reporter assay
EC50 11±n/a nM
Citation Bilotta, JAChen, ZChi, FChin, EDing, QErickson, SDGabriel, SDJiang, NKocer, BMertz, EPlancher, JWeikert, RJZhang, JZhang, Q Antiviral compounds US Patent US9693997 Publication Date 7/4/2017
 
Genome polyprotein
Name:Genome polyprotein
Type:Protease Domain
Mol. Mass.:327221.49
Organism:Hepatitis C virus (HCV genotype 1a, isolate H)
Description:P27958
Residue:3011
BDBM70681
NameBDBM70681
Synonyms:US9693997, 204
TypeSmall organic molecule
Emp. Form.C21H23ClF3N7O3S
Mol. Mass.545.966
SMILESCOc1ccc(cc1S(=O)(=O)NC1CCNCC1)-c1c(Cl)cc(Nc2n[nH]c(N)n2)cc1C(F)(F)F