Reaction Details
TargetGenome polyprotein
LigandBDBM70748
Substrate/Competitorn/a
Meas. Tech.Pseudotyped HCV particle (HCVpp) reporter assay
EC50 13±n/a nM
Citation Bilotta, JAChen, ZChi, FChin, EDing, QErickson, SDGabriel, SDJiang, NKocer, BMertz, EPlancher, JWeikert, RJZhang, JZhang, Q Antiviral compounds US Patent US9693997 Publication Date 7/4/2017
 
Genome polyprotein
Name:Genome polyprotein
Type:Protease Domain
Mol. Mass.:327221.49
Organism:Hepatitis C virus (HCV genotype 1a, isolate H)
Description:P27958
Residue:3011
BDBM70748
NameBDBM70748
Synonyms:US9693997, 250
TypeSmall organic molecule
Emp. Form.C21H20Cl2F2N6O
Mol. Mass.481.326
SMILESNc1nc(Nc2cc(Cl)c(c(Cl)c2)-c2ccc(NC(=O)C3CCC(F)(F)CC3)cc2)n[nH]1