Reaction Details
TargetLysine-specific demethylase 2A
LigandBDBM276040
Substrate/Competitorn/a
Meas. Tech.FBXL11 Assay
IC50 300±n/a nM
Citation Chen, YKNie, ZStafford, JAVeal, JM Histone demethylase inhibitors US Patent US9896436 Publication Date 2/20/2018
 
Lysine-specific demethylase 2A
Name:Lysine-specific demethylase 2A
Type:Enzyme Catalytic Domain
Mol. Mass.:132809.04
Organism:Homo sapiens (Human)
Description:n/a
Residue:1162
BDBM276040
NameBDBM276040
Synonyms:2-[1-[(2-chlorophenyl)methyl]imidazol-4-yl]-4-(1H-triazol-4-yl)pyridine US10174003, Example 2 | US9896436, Example 2
TypeSmall organic molecule
Emp. Form.C17H13ClN6
Mol. Mass.336.778
SMILESClc1ccccc1Cn1cnc(c1)-c1cc(ccn1)-c1c[nH]nn1