Reaction Details
TargetLysine-specific demethylase 2B
LigandBDBM276041
Substrate/Competitorn/a
Meas. Tech.FBXL10 Assay
IC50<100±n/a nM
Citation Chen, YKNie, ZStafford, JAVeal, JM Histone demethylase inhibitors US Patent US9896436 Publication Date 2/20/2018
 
Lysine-specific demethylase 2B
Name:Lysine-specific demethylase 2B
Type:Enzyme Catalytic Domain
Mol. Mass.:152658.35
Organism:Homo sapiens (Human)
Description:Q8NHM5
Residue:1336
BDBM276041
NameBDBM276041
Synonyms:2-[5-(4-fluorophenyl)-1-methylimidazol-4-yl]-4-(1H-triazol-4-yl)pyridine US10174003, Example 3 | US9896436, Example 3
TypeSmall organic molecule
Emp. Form.C17H13FN6
Mol. Mass.320.3237
SMILESCn1cnc(c1-c1ccc(F)cc1)-c1cc(ccn1)-c1c[nH]nn1