Reaction Details
TargetHistone lysine demethylase PHF8
LigandBDBM276054
Substrate/Competitorn/a
Meas. Tech.PHF8 Assay
IC50 300±n/a nM
Citation Chen, YKNie, ZStafford, JAVeal, JM Histone demethylase inhibitors US Patent US9896436 Publication Date 2/20/2018
 
Histone lysine demethylase PHF8
Name:Histone lysine demethylase PHF8
Type:Protein
Mol. Mass.:117889.91
Organism:Homo sapiens (Human)
Description:Q9UPP1
Residue:1060
BDBM276054
NameBDBM276054
Synonyms:4-[2-[1-(2-naphthalen-1-ylethyl)imidazol-4-yl]pyridin-4-yl]-1H-triazole-5-carbonitrile US9896436, Example 16
TypeSmall organic molecule
Emp. Form.C23H17N7
Mol. Mass.391.428
SMILESN#Cc1[nH]nnc1-c1ccnc(c1)-c1cn(CCc2cccc3ccccc23)cn1