Reaction Details
TargetLysine-specific demethylase 2B
LigandBDBM276073
Substrate/Competitorn/a
Meas. Tech.FBXL10 Assay
IC50<100±n/a nM
Citation Chen, YKNie, ZStafford, JAVeal, JM Histone demethylase inhibitors US Patent US9896436 Publication Date 2/20/2018
 
Lysine-specific demethylase 2B
Name:Lysine-specific demethylase 2B
Type:Enzyme Catalytic Domain
Mol. Mass.:152658.35
Organism:Homo sapiens (Human)
Description:Q8NHM5
Residue:1336
BDBM276073
NameBDBM276073
Synonyms:4-(5-fluoro-1H-triazol-4-yl)-2-[1-(2-naphthalen-1-ylethyl)imidazol-4-yl]pyridine US10174003, Example 35 | US9896436, Example 35
TypeSmall organic molecule
Emp. Form.C22H17FN6
Mol. Mass.384.409
SMILESFc1[nH]nnc1-c1ccnc(c1)-c1cn(CCc2cccc3ccccc23)cn1