Reaction Details
TargetLysine-specific demethylase 4C
LigandBDBM319644
Substrate/Competitorn/a
Meas. Tech.JMJD2C Assay
IC50>10000±n/a nM
Citation Chen, YKNie, ZStafford, JAVeal, JM Histone demethylase inhibitors US Patent US9896436 Publication Date 2/20/2018
 
Lysine-specific demethylase 4C
Name:Lysine-specific demethylase 4C
Type:Protein
Mol. Mass.:119979.01
Organism:Homo sapiens (Human)
Description:Q9H3R0
Residue:1056
BDBM319644
NameBDBM319644
Synonyms:2-{1-[(4-chlorophenyl)methyl]-1H-imidazol-4-yl}-4- [5-(trifluoromethyl)-1H-1,2,3-triazol-4-yl]pyridine US9896436, Example 63
TypeSmall organic molecule
Emp. Form.C18H12ClF3N6
Mol. Mass.404.776
SMILESFC(F)(F)c1[nH]nnc1-c1ccnc(c1)-c1cn(Cc2ccc(Cl)cc2)cn1