Reaction Details
TargetLysine-specific demethylase 2B
LigandBDBM319672
Substrate/Competitorn/a
Meas. Tech.FBXL10 Assay
IC50<100±n/a nM
Citation Chen, YKNie, ZStafford, JAVeal, JM Histone demethylase inhibitors US Patent US9896436 Publication Date 2/20/2018
 
Lysine-specific demethylase 2B
Name:Lysine-specific demethylase 2B
Type:Enzyme Catalytic Domain
Mol. Mass.:152658.35
Organism:Homo sapiens (Human)
Description:Q8NHM5
Residue:1336
BDBM319672
NameBDBM319672
Synonyms:2-{1-[2-(4-methylphenyl)ethyl]-1H-imidazol-4-yl}- 4-[5-(trifluoromethyl)-1H-1,2,3-triazol-4-yl]pyridine US9896436, Example 91
TypeSmall organic molecule
Emp. Form.C20H17F3N6
Mol. Mass.398.3844
SMILESCc1ccc(CCn2cnc(c2)-c2cc(ccn2)-c2nn[nH]c2C(F)(F)F)cc1