Reaction Details
TargetBifunctional purine biosynthesis protein ATIC
LigandBDBM22578
Substrate/CompetitorBDBM22579
Meas. Tech.AICAR Tfase Inhibition Assay
pH7.5±n/a
Temperature295.15±n/a K
Ki 7100±n/a nM
IC50 11600±100 nM
Citation Xu, LLi, COlson, AJWilson, IA Crystal structure of avian aminoimidazole-4-carboxamide ribonucleotide transformylase in complex with a novel non-folate inhibitor identified by virtual ligand screening. J Biol Chem279:50555-65 (2004) 
 
Bifunctional purine biosynthesis protein ATIC
Name:Bifunctional purine biosynthesis protein ATIC
Type:Protein
Mol. Mass.:64616.62
Organism:Homo sapiens (Human)
Description:P31939
Residue:592
BDBM22578
BDBM22579
NameBDBM22578
Synonyms:2-[(E)-2-[5-hydroxy-3-methyl-1-(2-methyl-4-sulfophenyl)-1H-pyrazol-4-yl]diazen-1-yl]-4-sulfobenzoic acid 326203-A
TypeSmall organic molecule
Emp. Form.C18H16N4O9S2
Mol. Mass.496.471
SMILESCc1[nH]n(-c2ccc(cc2C)S(O)(=O)=O)c(=O)c1N=Nc1cc(ccc1C(O)=O)S(O)(=O)=O