Reaction Details
TargetBifunctional purine biosynthesis protein ATIC
LigandBDBM22588
Substrate/CompetitorBDBM22586
Meas. Tech.IMPCH Activity Assay
pH7.4±n/a
Temperature295.15±n/a K
Ki 150±n/a nM
Citation Xu, LChong, YHwang, ID'Onofrio, AAmore, KBeardsley, GPLi, COlson, AJBoger, DLWilson, IA Structure-based design, synthesis, evaluation, and crystal structures of transition state analogue inhibitors of inosine monophosphate cyclohydrolase. J Biol Chem282:13033-46 (2007) 
 
Bifunctional purine biosynthesis protein ATIC
Name:Bifunctional purine biosynthesis protein ATIC
Type:Protein
Mol. Mass.:64616.62
Organism:Homo sapiens (Human)
Description:P31939
Residue:592
BDBM22588
BDBM22586
NameBDBM22588
Synonyms:Nucleotide, 3 | {[(2R,3S,4R,5R)-3,4-dihydroxy-5-(2,2,4-trioxo-1H,3H,4H,7H-2,1,3,5,7-imidazo[4,5-c][1,2,6]thiadiazin-7-yl)oxolan-2-yl]methoxy}phosphonic acid
TypeNucleoside or nucleotide
Emp. Form.C9H13N4O10PS
Mol. Mass.400.259
SMILESO[C@@H]1[C@@H](COP(O)(O)=O)O[C@H]([C@@H]1O)n1cnc2c1NS(=O)(=O)NC2=O